HOSPNUM,RDELAY,RCONSC,SEX,AGE,RSLEEP,RATRIAL,RCT,RVISINF,RHEP24,RASP3,RSBP,RDEF1,RDEF2,RDEF3,RDEF4,RDEF5,RDEF6,RDEF7,RDEF8,STYPE,RDATE,HOURLOCAL,MINLOCAL,DAYLOCAL,RXASP,RXHEP,DASP14,DASPLT,DLH14,DMH14,DHH14,ONDRUG,DSCH,DIVH,DAP,DOAC,DGORM,DSTER,DCAA,DHAEMD,DCAREND,DTHROMB,DMAJNCH,DMAJNCHD,DMAJNCHX,DSIDE,DSIDED,DSIDEX,DDIAGISC,DDIAGHA,DDIAGUN,DNOSTRK,DNOSTRKX,DRSISC,DRSISCD,DRSH,DRSHD,DRSUNK,DRSUNKD,DPE,DPED,DALIVE,DALIVED,DPLACE,DDEAD,DDEADD,DDEADC,DDEADX,FDEAD,FLASTD,FDEADD,FDEADC,FDEADX,FRECOVER,FDENNIS,FPLACE,FAP,FOAC, FU1_RECD , FU2_DONE ,COUNTRY,CNTRYNUM,FU1_COMP,NCCODE,CMPLASP,CMPLHEP,DIED,TD,EXPDD,EXPD6,EXPD14,SET14D,ID14,OCCODE,DEAD1,DEAD2,DEAD3,DEAD4,DEAD5,DEAD6,DEAD7,DEAD8,H14,ISC14,NK14,STRK14,HTI14,PE14,DVT14,TRAN14,NCB14
1,17,D,M,69,Y,,Y,Y,,,140,N,N,N,Y,N,Y,N,Y,PACS,1991-01,99,99,4,Y,N,Y,Y,N,,N,14,,,N,N,N,N,N,N,,,N,,,N,,,Y,N,N,N,,N,,N,,,,N,,N,,,N,,0,,N,,,,,N,Y,E,,,14,187,UK,27,,13,Y,Y,0,187,0.698,0.2344,0.1054,1,0,2,0,0,0,0,0,0,0,0,0,0,0,0,0,0,0,0,0
1,10,F,M,76,Y,,Y,N,,,150,Y,Y,Y,N,N,N,N,N,LACS,1991-01,99,99,7,N,L,N,Y,Y,,N,14,,,N,N,N,N,Y,N,,,N,,,N,,,Y,N,N,N,,N,,N,,,,N,,N,,,N,,0,,N,,,,,N,Y,A,,,16,192,UK,27,,,Y,Y,0,192,0.5389,0.1555,0.0421,1,0,2,0,0,0,0,0,0,0,0,0,0,0,0,0,0,0,0,0
1,43,F,F,71,N,,Y,N,,,170,Y,Y,Y,N,N,N,N,N,LACS,1991-01,99,99,3,Y,N,Y,Y,N,,N,11,,,N,N,N,N,N,N,,,N,,,N,,,Y,N,N,N,,N,,N,,,,N,,Y,32,,N,,0,,N,,,,,N,Y,A,,,11,189,UK,27,,,Y,Y,0,189,0.5275,0.1009,0.0323,1,0,2,0,0,0,0,0,0,0,0,0,0,0,0,0,0,0,0,0
1,6,F,M,81,N,,N,N,,,170,N,N,N,Y,N,N,N,N,PACS,1991-01,99,99,7,N,H,N,Y,N,,Y,14,,,N,N,N,N,Y,N,,,N,,,N,,,Y,N,N,N,,N,,N,,,,N,,Y,41,,N,,0,,N,,,,,Y,N,A,,,23,183,UK,27,,,Y,Y,0,183,0.4021,0.1147,0.0244,1,0,4,0,0,0,0,0,0,0,0,0,0,0,0,0,0,0,0,0
4,20,F,M,78,N,,N,N,,,170,Y,Y,Y,N,N,N,N,N,LACS,1991-02,99,99,6,Y,H,Y,Y,N,,Y,14,,,N,N,N,N,N,N,,,N,,,N,,,Y,N,N,N,,N,,N,,,,N,,N,,,N,,0,,N,,,,,N,Y,E,,,17,214,UK,27,,,Y,Y,0,214,0.56,0.1709,0.0441,1,0,2,0,0,0,0,0,0,0,0,0,0,0,0,0,0,0,0,0
1,39,F,M,54,N,,Y,N,,,135,Y,Y,Y,N,N,N,N,N,LACS,1991-02,99,99,2,N,N,N,Y,N,,N,7,,,N,N,N,N,N,N,,,N,,,N,,,Y,N,N,N,,N,,N,,,,N,,Y,10,,N,,0,,N,,,,,N,N,A,,,16,185,UK,27,,,Y,Y,0,185,0.3132,0.0471,0.0244,1,0,3,0,0,0,0,0,0,0,0,0,0,0,0,0,0,0,0,0
1,4,F,F,77,N,,N,N,,,140,Y,Y,Y,N,N,N,Y,N,POCS,1991-02,99,99,1,Y,N,Y,Y,N,,N,14,,,N,N,N,N,N,N,,,N,,,Y,23,NOSE BLEED 15 MINS,N,N,N,Y,,N,,N,,,,N,,N,,,N,,0,,N,,,,,N,N,A,,,15,194,UK,27,24,,Y,Y,0,194,0.7285,0.1873,0.053,1,0,3,0,0,0,0,0,0,0,0,0,0,0,0,0,0,0,0,1
1,24,F,M,23,N,,Y,N,,,120,N,N,N,N,N,N,N,Y,OTH,1991-02,99,99,2,N,L,N,N,Y,,N,11,,,N,N,N,N,N,N,,,N,,,N,,,Y,N,N,N,,N,,N,,,,N,,Y,21,,N,,0,,N,,,,,N,N,A,,,37,193,UK,27,,,Y,Y,0,193,0.15,0.0038,0.0054,1,0,3,0,0,0,0,0,0,0,0,0,0,0,0,0,0,0,0,0
1,18,F,M,47,N,,N,N,,,150,N,N,N,N,N,N,N,Y,OTH,1991-02,99,99,2,Y,H,Y,Y,N,,Y,5,,,N,N,N,N,N,N,,,N,,,N,,,Y,N,N,N,,N,,N,,,,N,,Y,29,,N,,0,,N,,,,,N,N,A,,,23,193,UK,27,,,Y,Y,0,193,0.1334,0.0162,0.0102,1,0,3,0,0,0,0,0,0,0,0,0,0,0,0,0,0,0,0,0
1,13,F,M,81,Y,,N,N,,,170,N,N,N,N,N,Y,N,Y,PACS,1991-02,99,99,2,N,N,N,N,N,,N,14,,,N,N,N,N,N,N,,,N,,,N,,,Y,N,N,N,,N,,N,,,,N,,Y,38,,N,,0,,N,,,,,N,Y,A,,,42,189,UK,27,,,Y,Y,0,189,0.4964,0.1476,0.0337,1,0,2,0,0,0,0,0,0,0,0,0,0,0,0,0,0,0,0,0
1,14,D,M,48,Y,,Y,N,,,174,Y,Y,Y,N,N,N,Y,N,POCS,1991-03,99,99,7,Y,L,Y,Y,Y,,N,11,,,N,N,N,N,N,N,,,N,,,N,,,Y,N,N,N,,N,,N,,,,N,,Y,12,,N,,0,,N,,,,,N,N,A,,,24,194,UK,27,,,Y,Y,0,194,0.612,0.1091,0.0889,1,0,3,0,0,0,0,0,0,0,0,0,0,0,0,0,0,0,0,0
1,16,F,F,45,N,,Y,Y,,,170,Y,Y,Y,Y,N,N,N,N,PACS,1991-03,99,99,5,N,N,N,Y,N,,N,1,,,N,N,N,N,N,N,,,N,,,N,,,Y,N,N,N,,N,,N,,,,N,,Y,7,,N,,0,,N,,,,,Y,N,A,,,13,221,UK,27,,,Y,Y,0,221,0.4118,0.0322,0.0237,1,0,4,0,0,0,0,0,0,0,0,0,0,0,0,0,0,0,0,0
1,5,D,F,83,N,,N,N,,,130,Y,Y,Y,Y,Y,N,N,N,TACS,1991-03,99,99,6,N,H,N,N,N,,N,14,,,N,N,N,N,N,N,,,N,,,N,,,N,Y,N,N,,N,,N,,,,N,,N,,,N,,0,,N,,,,,N,N,D,,,24,242,UK,27,,4,Y,N,0,242,0.9489,0.5412,0.2304,1,0,3,0,0,0,0,0,0,0,0,0,0,0,0,0,0,0,0,0
1,12,F,F,86,Y,,Y,N,,,190,N,N,N,N,N,N,N,Y,OTH,1991-03,99,99,7,Y,N,Y,Y,N,,N,14,,,N,N,N,N,N,N,,,N,,,N,,,N,N,N,Y,,N,,N,,,,N,,N,,,N,,0,,U,199,,,,U,U,U,U,U,38,614,UK,27,,,Y,Y,0,614,0.5701,0.1284,0.0243,1,0,9,0,0,0,0,0,0,0,0,0,0,0,0,0,0,0,0,0
6,10,F,M,50,N,,N,N,,,130,N,N,N,N,N,N,N,Y,OTH,1991-03,99,99,6,Y,L,Y,N,Y,,N,6,,,N,N,N,N,N,N,,,N,,,N,,,Y,N,N,N,,N,,N,,,,N,,Y,27,,N,,0,,U,32,,,,U,U,U,U,U,17,608,UK,27,,,Y,Y,0,608,0.1528,0.0199,0.0111,1,0,9,0,0,0,0,0,0,0,0,0,0,0,0,0,0,0,0,0
6,10,F,F,68,N,,N,N,,,150,Y,Y,Y,Y,Y,C,N,N,TACS,1991-03,99,99,6,N,N,N,Y,N,,N,11,,,N,N,N,N,N,N,,,N,,,N,,,u,N,Y,N,,N,,N,,,,N,,Y,32,,N,,0,,N,,,,,N,Y,A,,,17,206,UK,27,,,Y,Y,0,206,0.7838,0.2047,0.0816,1,0,2,0,0,0,0,0,0,0,0,0,0,0,0,0,0,0,0,0
1,8,D,F,64,Y,,Y,Y,,,180,Y,Y,Y,N,Y,Y,N,N,TACS,1991-03,99,99,2,Y,H,Y,Y,N,,Y,14,,,N,N,N,N,N,N,,,N,,,N,,,Y,N,N,N,,N,,N,,,,N,,N,,,N,,0,,N,,,,,N,Y,A,,,21,198,UK,27,,,Y,Y,0,198,0.848,0.278,0.1559,1,0,2,0,0,0,0,0,0,0,0,0,0,0,0,0,0,0,0,0
1,29,F,M,63,N,,Y,Y,,,150,Y,Y,Y,N,N,N,Y,N,POCS,1991-03,99,99,1,N,H,N,Y,N,,Y,9,,,N,N,N,N,N,N,,,N,,,N,,,Y,N,N,N,,N,,N,,,,N,,Y,39,,N,,0,,N,,,,,N,N,A,,,15,198,UK,27,,,Y,Y,0,198,0.4741,0.1041,0.0425,1,0,3,0,0,0,0,0,0,0,0,0,0,0,0,0,0,0,0,0
1,21,D,M,66,N,,Y,Y,,,140,Y,Y,Y,N,Y,Y,N,Y,TACS,1991-04,99,99,3,Y,N,Y,Y,N,,N,14,,,N,N,N,N,Y,N,,,N,,,N,,,Y,N,N,N,,N,,N,,,,N,,N,,,Y,17,4,,Y,,17,4,,,,,,,21,21,UK,27,,,Y,Y,1,16,0.8807,0.4158,0.2394,1,0,1,0,0,0,1,0,0,0,0,0,0,0,0,0,0,0,0,0
6,4,F,M,74,N,,N,N,,,150,Y,Y,Y,N,N,Y,N,N,PACS,1991-04,99,99,3,Y,N,Y,N,N,,N,10,,,N,N,N,N,N,N,,,N,,,N,,,U,N,Y,N,,N,,N,,,,N,,N,,,Y,11,7,UNKNOWN,Y,,11,7,UNKNOWN,,,,,,36,687,UK,27,,,Y,Y,1,10,0.6041,0.1789,0.055,1,1,1,0,0,0,0,0,0,1,0,0,0,0,0,0,0,0,0,0
1,14,F,F,56,N,,Y,Y,,,160,Y,Y,Y,N,Y,Y,N,N,TACS,1991-04,99,99,4,Y,L,Y,Y,Y,,N,7,,,N,N,N,N,Y,N,,,N,,,N,,,Y,N,N,N,,N,,N,,,,N,,Y,9,,N,,0,,N,,,,,N,Y,A,,,20,193,UK,27,,,Y,Y,0,193,0.5881,0.0842,0.0443,1,0,2,0,0,0,0,0,0,0,0,0,0,0,0,0,0,0,0,0
1,13,F,M,87,Y,,N,N,,,110,Y,Y,Y,N,Y,Y,N,N,TACS,1991-04,99,99,1,N,L,N,N,N,,N,14,,,N,Y,N,N,N,N,,,N,,,N,,,Y,N,N,N,,N,,N,,,,N,,N,,,N,,0,,N,,,,,N,Y,A,,,24,189,UK,27,,11,Y,N,0,189,0.8774,0.4015,0.104,1,0,2,0,0,0,0,0,0,0,0,0,0,0,0,0,0,1,0,0
6,22,D,M,84,N,,N,N,,,180,Y,Y,Y,N,Y,Y,N,N,TACS,1991-04,99,99,6,N,L,N,Y,Y,,N,14,,,N,N,N,N,N,N,,,N,,,N,,,U,N,Y,N,,N,,N,,,,N,,N,,,N,,0,,N,,,,,N,Y,E,,,26,215,UK,27,,,Y,Y,0,215,0.9295,0.5974,0.2601,1,0,2,0,0,0,0,0,0,0,0,0,0,0,0,0,0,0,0,0
6,2,F,M,43,Y,,Y,N,,,140,N,N,N,N,N,N,N,Y,OTH,1991-04,99,99,7,N,N,N,N,N,,N,14,,,N,N,N,N,N,N,,,N,,,N,,,Y,N,N,N,,N,,N,,,,N,,N,,,N,,0,,N,,,,,N,N,A,,,25,210,UK,27,,,Y,Y,0,210,0.1306,0.0129,0.0092,1,0,3,0,0,0,0,0,0,0,0,0,0,0,0,0,0,0,0,0
1,17,F,M,57,N,,N,N,,,190,Y,Y,Y,N,N,N,N,N,LACS,1991-04,99,99,2,Y,N,Y,Y,N,,N,4,,,N,N,N,N,Y,N,,,N,,,N,,,,N,Y,N,,N,,N,,,,N,,Y,18,,N,,0,,N,,,,,N,N,A,,,4,197,UK,27,,,Y,Y,0,197,0.3167,0.0556,0.0262,1,0,3,0,0,0,0,0,0,0,0,0,0,0,0,0,0,0,0,0
4,35,F,M,47,Y,,N,N,,,118,Y,Y,Y,N,N,N,N,N,LACS,1991-04,99,99,2,N,H,N,Y,N,,Y,1,,,N,N,N,N,N,N,,,N,,,N,,,Y,N,N,N,,N,,N,,,,N,,Y,15,,N,,0,,N,,,,,N,N,A,,,14,218,UK,27,,,Y,Y,0,218,0.2957,0.0301,0.02,1,0,3,0,0,0,0,0,0,0,0,0,0,0,0,0,0,0,0,0
1,45,F,M,71,N,,N,N,,,120,N,N,N,Y,Y,C,N,N,PACS,1991-04,99,99,2,Y,L,Y,Y,Y,,N,14,,,N,N,N,N,N,N,,,N,,,N,,,Y,N,N,N,,N,,N,,,,N,,N,,,N,,0,,N,,,,,N,N,A,,,16,197,UK,27,,,Y,Y,0,197,0.4964,0.117,0.0368,1,0,3,0,0,0,0,0,0,0,0,0,0,0,0,0,0,0,0,0
4,18,F,M,70,N,,N,N,,,160,N,N,N,Y,N,Y,N,N,PACS,1991-04,99,99,6,N,N,N,Y,N,,N,7,,,N,N,N,N,N,N,,,N,,,N,,,Y,N,N,N,,N,,N,,,,N,,Y,25,,N,,0,,N,,,,,N,N,A,,,56,214,UK,27,,,Y,Y,0,214,0.3471,0.0852,0.026,1,0,3,0,0,0,0,0,0,0,0,0,0,0,0,0,0,0,0,0
8,19,F,M,64,N,,Y,Y,,,170,N,N,N,Y,N,N,N,Y,PACS,1991-04,99,99,7,Y,H,Y,Y,N,,Y,14,,,N,Y,N,N,N,N,,,N,,,N,,,Y,N,N,N,,N,,N,,,,N,,Y,39,,N,,0,,N,,,,,N,Y,A,,,32,209,UK,27,,,Y,Y,0,209,0.2832,0.0614,0.0224,1,0,2,0,0,0,0,0,0,0,0,0,0,0,0,0,0,0,0,0
1,3,F,M,79,N,,Y,N,,,180,N,N,N,N,N,N,N,Y,OTH,1991-04,99,99,3,N,N,N,N,N,,N,4,,,N,N,N,N,N,N,,,N,,,N,,,Y,N,N,N,,N,,N,,,,N,,Y,26,,N,,0,,N,,,,,Y,Y,A,,,8,202,UK,27,,,Y,Y,0,202,0.3613,0.0998,0.0228,1,0,2,0,0,0,0,0,0,0,0,0,0,0,0,0,0,0,0,0
6,4,D,F,83,N,,N,N,,,120,Y,Y,Y,N,N,Y,N,N,PACS,1991-04,99,99,5,Y,N,Y,Y,N,,N,14,,,N,N,N,N,N,N,,,N,,,N,,,U,N,Y,N,,N,,N,,,,N,,N,,,N,,0,,N,,,,,N,Y,A,,,26,203,UK,27,,,Y,Y,0,203,0.9283,0.4601,0.1747,1,0,2,0,0,0,0,0,0,0,0,0,0,0,0,0,0,0,0,0
1,11,F,F,81,Y,,Y,Y,,,210,Y,Y,Y,N,N,Y,N,N,PACS,1991-04,99,99,2,Y,H,N,N,N,,N,14,,,N,N,N,N,N,N,,,Y,38,LARGE BLEED INTO LEG,N,,,Y,N,N,N,,N,,N,,,,N,,N,,,N,,0,,N,,,,,N,Y,E,,,23,193,UK,27,42,,N,N,0,193,0.7819,0.2279,0.0587,1,0,2,0,0,0,0,0,0,0,0,0,0,0,0,0,0,0,1,1
6,20,F,M,83,N,,N,N,,,160,Y,Y,Y,N,Y,Y,N,N,TACS,1991-04,99,99,3,Y,N,N,N,N,,N,14,,,N,N,N,N,N,N,,,N,,,N,,,U,N,Y,N,,Y,31,N,,,,N,,N,,,Y,45,4,,Y,,45,4,,,,,,,21,564,UK,27,,,N,Y,1,16,0.8107,0.3509,0.0957,1,0,1,0,0,0,1,0,0,0,0,0,1,0,1,0,0,0,0,0
6,18,F,M,68,N,,N,N,,,170,N,N,N,N,N,N,Y,Y,POCS,1991-05,99,99,4,N,L,N,N,Y,,N,10,,,N,N,N,N,N,N,,,N,,,N,,,U,N,Y,N,,N,,N,,,,N,,Y,10,,N,,0,,N,,,,,Y,N,A,,,20,193,UK,27,,,Y,Y,0,193,0.3214,0.0761,0.0247,1,0,4,0,0,0,0,0,0,0,0,0,0,0,0,0,0,0,0,0
1,6,D,F,65,Y,,Y,Y,,,170,Y,Y,Y,Y,Y,N,N,N,TACS,1991-05,99,99,6,N,N,N,Y,N,,N,14,,,N,N,N,N,N,N,,,N,,,N,,,Y,N,N,N,,N,,N,,,,N,,N,,,N,,0,,N,,,,,N,Y,A,,,19,192,UK,27,,,Y,Y,0,192,0.8535,0.2904,0.1594,1,0,2,0,0,0,0,0,0,0,0,0,0,0,0,0,0,0,0,0
3,16,F,F,78,Y,,Y,Y,,,170,Y,Y,Y,Y,Y,Y,N,Y,TACS,1991-05,99,99,2,N,N,N,Y,N,,N,14,,,N,N,Y,N,N,N,,,N,,,N,,,Y,N,N,N,,N,,N,,,,N,,N,,,N,,0,,N,,,,,N,Y,B,U,U,36,191,ITAL,14,,,Y,Y,0,191,0.9057,0.3964,0.1405,1,0,2,0,0,0,0,0,0,0,0,0,0,0,0,0,0,0,0,0
1,11,D,M,85,N,,Y,Y,,,150,Y,Y,Y,Y,C,N,N,N,TACS,1991-05,99,99,3,N,N,N,Y,N,,N,14,,,N,N,N,N,N,N,,,N,,,N,,,Y,N,N,N,,N,,N,,,,N,,N,,,N,,0,,N,,,,,N,N,E,,,70,185,UK,27,,,Y,Y,0,185,0.9344,0.6065,0.2632,1,0,3,0,0,0,0,0,0,0,0,0,0,0,0,0,0,0,0,0
8,24,F,M,75,N,,Y,Y,,,140,N,N,N,Y,N,N,N,Y,PACS,1991-05,99,99,2,Y,L,Y,Y,Y,,N,4,,,N,N,N,N,N,N,,,N,,,N,,,Y,N,N,N,,N,,N,,,,N,,Y,9,,N,,0,,N,,,,,Y,N,A,,,107,197,UK,27,,,Y,Y,0,197,0.425,0.1103,0.0293,1,0,4,0,0,0,0,0,0,0,0,0,0,0,0,0,0,0,0,0
6,18,F,M,78,N,,N,N,,,130,Y,Y,Y,Y,Y,Y,N,N,TACS,1991-05,99,99,4,Y,H,Y,N,N,,Y,14,,,N,N,N,N,N,N,,,N,,,N,,,N,N,Y,N,,N,,N,,,,N,,N,,,N,,0,,N,,,,,N,Y,E,,,33,188,UK,27,,,Y,Y,0,188,0.8353,0.3527,0.1154,1,0,2,0,0,0,0,0,0,0,0,0,0,0,0,0,0,0,0,0
1,9,F,F,53,N,,Y,Y,,,160,N,N,N,N,Y,Y,N,N,PACS,1991-05,99,99,5,Y,N,Y,Y,N,,N,7,,,N,N,N,N,N,N,,,N,,,N,,,Y,N,N,N,,N,,N,,,,N,,Y,15,,N,,0,,N,,,,,N,Y,A,,,68,187,UK,27,,,Y,Y,0,187,0.2633,0.0269,0.0146,1,0,2,0,0,0,0,0,0,0,0,0,0,0,0,0,0,0,0,0
3,23,F,F,81,N,,Y,Y,,,140,Y,Y,Y,N,Y,N,N,N,PACS,1991-05,99,99,5,Y,L,Y,Y,Y,,N,14,,,N,N,N,N,Y,N,,,N,,,N,,,Y,N,N,N,,N,,N,,,,N,,N,,,N,,0,,N,,,,,N,Y,B,U,U,26,184,ITAL,14,,,Y,Y,0,184,0.7751,0.2243,0.0582,1,0,2,0,0,0,0,0,0,0,0,0,0,0,0,0,0,0,0,0
8,9,F,M,59,N,,Y,Y,,,170,Y,Y,Y,N,N,N,Y,N,POCS,1991-05,99,99,1,N,N,N,N,N,,N,1,,,N,N,N,N,N,N,,,N,,,N,,,Y,N,N,N,,N,,N,,,,N,,N,,,Y,19,4,,Y,,19,4,,,,,,,94,94,UK,27,,,Y,Y,1,1,0.4242,0.0824,0.0382,1,1,1,0,0,0,1,0,0,0,0,0,0,0,0,0,0,0,0,0
10,24,F,M,64,Y,,Y,Y,,,210,Y,Y,Y,Y,N,N,N,N,PACS,1991-05,99,99,4,N,H,N,Y,N,,Y,14,,,N,N,N,N,Y,N,,,N,,,N,,,Y,N,N,N,,Y,23,N,,,,N,,N,,,N,,0,,N,,,,,Y,N,U,U,U,36,163,ITAL,14,,,Y,Y,0,163,0.4946,0.1081,0.0432,1,0,4,0,0,0,0,0,0,0,0,0,1,0,1,0,0,0,0,0
1,9,F,F,86,N,,N,N,,,190,Y,Y,Y,N,Y,Y,N,N,TACS,1991-05,99,99,6,Y,N,N,N,N,,N,14,,,N,N,N,N,N,N,,,N,,,Y,24,?HTI,Y,N,N,N,,N,,N,,,,N,,N,,,N,,0,,Y,,181,6,,,,,,,53,158,UK,27,,,N,Y,1,158,0.8809,0.3563,0.0913,1,0,1,0,0,0,0,0,1,0,0,1,0,0,1,1,0,0,0,0
1,3,F,F,67,N,,Y,Y,,,160,N,N,N,N,Y,Y,N,N,PACS,1991-05,99,99,6,N,N,N,N,N,,N,14,,,N,N,N,N,N,N,,,N,,,N,,,Y,N,N,N,,Y,24,N,,,,N,,N,,,N,,0,,N,,,,,N,Y,E,,,18,180,UK,27,,,Y,Y,0,180,0.3822,0.0618,0.0211,1,0,2,0,0,0,0,0,0,0,0,0,1,0,1,0,0,0,0,0
10,24,F,M,63,Y,,Y,N,,,200,Y,Y,Y,N,N,N,N,N,LACS,1991-05,99,99,2,Y,N,Y,Y,N,,N,14,,,N,N,Y,N,Y,N,,,N,,,N,,,Y,N,N,N,,N,,N,,,,N,,N,,,N,,0,,N,,,,,Y,N,A,U,U,31,185,ITAL,14,,,Y,Y,0,185,0.3742,0.0776,0.0304,1,0,4,0,0,0,0,0,0,0,0,0,0,0,0,0,0,0,0,0
4,35,F,M,67,N,,N,N,,,180,Y,Y,Y,Y,N,C,N,N,PACS,1991-05,99,99,3,Y,L,Y,Y,Y,,N,14,,,N,N,N,N,N,N,,,N,,,N,,,Y,N,N,N,,N,,N,,,,N,,Y,71,,N,,0,,N,,,,,N,N,A,,,91,184,UK,27,,,Y,Y,0,184,0.6163,0.1705,0.0652,1,0,3,0,0,0,0,0,0,0,0,0,0,0,0,0,0,0,0,0
1,26,D,M,64,N,,Y,Y,,,150,Y,Y,Y,Y,Y,N,N,N,TACS,1991-06,99,99,7,N,H,N,N,N,,Y,8,,,N,N,N,N,Y,N,,,N,,,N,,,Y,N,N,N,,N,,N,,,,N,,N,,,Y,8,1,,Y,,8,1,,,,,,,10,10,UK,27,,,Y,Y,1,8,0.8091,0.3122,0.1742,1,1,1,1,0,0,0,0,0,0,0,0,0,0,0,0,0,0,0,0
3,47,F,F,79,N,,Y,Y,,,150,Y,Y,Y,N,N,N,N,N,LACS,1991-06,99,99,2,N,H,N,Y,N,,Y,8,,,N,N,N,N,Y,N,,,N,,,Y,11,MINOR BLEED / HAEMORRHOIDS,Y,N,N,N,,N,,N,,,,N,,N,,,N,,0,,N,,,,,N,Y,B,U,U,8,189,ITAL,14,16,,Y,Y,0,189,0.659,0.1581,0.04,1,0,2,0,0,0,0,0,0,0,0,0,0,0,0,0,0,0,0,1
1,25,D,F,80,N,,Y,Y,,,160,N,N,N,N,N,N,Y,N,POCS,1991-06,99,99,2,N,L,N,Y,Y,,N,14,,,N,N,N,N,N,N,,,N,,,N,,,Y,N,N,N,,N,,N,,,,N,,N,,,N,,0,,N,,,,,Y,Y,A,,,43,190,UK,27,,,Y,Y,0,190,0.7066,0.2064,0.0639,1,0,2,0,0,0,0,0,0,0,0,0,0,0,0,0,0,0,0,0
6,6,F,F,62,Y,,N,N,,,130,Y,Y,Y,N,Y,Y,C,N,TACS,1991-06,99,99,3,Y,N,Y,Y,N,,N,14,,,N,N,N,N,N,N,,,N,,,N,,,Y,N,N,N,,N,,N,,,,N,,N,,,N,,0,,N,,,,,N,Y,A,,,17,163,UK,27,,,Y,Y,0,163,0.7504,0.1525,0.0707,1,0,2,0,0,0,0,0,0,0,0,0,0,0,0,0,0,0,0,0
6,6,F,F,68,N,,N,N,,,130,Y,Y,Y,Y,Y,Y,N,N,TACS,1991-06,99,99,4,N,L,N,Y,Y,,N,14,,,N,N,N,N,N,N,,,N,,,N,,,Y,N,N,N,,N,,N,,,,Y,30,N,,,Y,37,4,,Y,,37,4,,,,,,,43,37,UK,27,,,Y,Y,1,33,0.7964,0.2031,0.0812,1,0,1,0,0,0,1,0,0,0,0,0,0,0,0,0,0,0,0,0
1,29,F,M,71,N,,Y,Y,,,150,N,N,N,Y,N,N,N,N,PACS,1991-06,99,99,4,Y,N,Y,Y,N,,N,10,,,N,N,N,N,N,N,,,N,,,N,,,Y,N,N,N,,N,,N,,,,N,,Y,14,A,N,,0,,N,,,,,N,N,E,,,41,189,UK,27,,,Y,Y,0,189,0.2689,0.0651,0.0188,1,0,3,0,0,0,0,0,0,0,0,0,0,0,0,0,0,0,0,0
6,15,D,F,78,N,,N,N,,,170,Y,Y,Y,N,Y,Y,N,Y,TACS,1991-06,99,99,5,Y,H,Y,N,N,,Y,1,,,N,N,N,N,N,N,,,N,,,N,,,U,N,Y,N,,N,,N,,,,N,,N,,,Y,6,1,,Y,,6,1,,,,,,,40,34,UK,27,,,Y,Y,1,1,0.9471,0.5477,0.2712,1,1,1,1,0,0,0,0,0,0,0,0,0,0,0,0,0,0,0,0
3,12,F,M,84,N,,Y,N,,,200,N,N,N,Y,N,N,N,N,PACS,1991-06,99,99,6,N,N,N,Y,N,,N,4,,,N,N,N,N,Y,N,,,N,,,N,,,Y,N,N,N,,N,,N,,,,N,,N,,,N,,0,,N,,,,,N,Y,A,U,U,4,186,ITAL,14,,,Y,Y,0,186,0.4617,0.1327,0.0262,1,0,2,0,0,0,0,0,0,0,0,0,0,0,0,0,0,0,0,0
8,24,F,M,64,N,,Y,Y,,,150,N,N,N,N,N,N,N,N,PACS,1991-06,99,99,6,Y,H,Y,Y,N,,Y,5,,,N,N,N,N,N,N,,,N,,,N,,,Y,N,N,N,,N,,N,,,,N,,Y,11,,N,,0,,N,,,,,Y,N,C,,,75,191,UK,27,,,Y,Y,0,191,0.1491,0.033,0.0113,1,0,4,0,0,0,0,0,0,0,0,0,0,0,0,0,0,0,0,0
8,29,D,M,64,N,,Y,Y,,,180,Y,Y,Y,N,N,Y,N,N,PACS,1991-06,99,99,7,N,N,N,N,N,,N,14,,,N,N,N,N,N,N,,,N,,,N,,,Y,N,N,N,,N,,N,,,,N,,N,,,N,,0,,N,,,,,N,N,A,,,74,192,UK,27,,,Y,Y,0,192,0.7209,0.2368,0.1271,1,0,3,0,0,0,0,0,0,0,0,0,0,0,0,0,0,0,0,0
1,28,D,F,84,N,,Y,Y,,,190,Y,Y,Y,Y,Y,N,N,N,TACS,1991-06,99,99,3,Y,L,Y,Y,Y,,N,14,,,N,N,N,N,N,N,,,N,,,N,,,Y,N,N,N,,N,,N,,,,N,,N,,,N,,0,,Y,,156,4,,,,,,,35,146,UK,27,,,Y,Y,1,146,0.948,0.5581,0.2356,1,0,1,0,0,0,1,0,0,0,0,0,0,0,0,0,0,0,0,0
3,12,F,M,80,N,,Y,Y,,,140,N,N,N,N,N,Y,N,Y,PACS,1991-06,99,99,3,Y,N,Y,Y,N,,N,0,,,N,N,Y,N,N,N,,,N,,,N,,,Y,N,N,N,,N,,N,,,,N,,Y,16,,N,,0,,N,,,,,N,Y,U,U,U, -      ,183,ITAL,14,,,Y,Y,0,183,0.5044,0.1434,0.0332,1,0,2,0,0,0,0,0,0,0,0,0,0,0,0,0,0,0,0,0
3,47,F,F,88,N,,Y,Y,,,120,Y,Y,Y,N,Y,N,N,Y,PACS,1991-06,99,99,4,N,H,N,N,N,,Y,14,,,N,N,N,N,N,N,,,N,,,N,,,Y,N,N,N,,N,,N,,,,N,,N,,,N,,0,,N,,,,,N,Y,A,N,N,76,184,ITAL,14,,,Y,Y,0,184,0.9119,0.3871,0.0961,1,0,2,0,0,0,0,0,0,0,0,0,0,0,0,0,0,0,0,0
6,22,F,F,65,N,,N,N,,,160,Y,Y,Y,Y,C,C,C,C,TACS,1991-06,99,99,7,N,N,N,N,N,,N,14,,,N,N,N,N,N,N,,,N,,,N,,,Y,N,N,N,,N,,N,,,,N,,N,,,N,,0,,Y,,34,0,,,,,,,61,613,UK,27,,,Y,Y,1,20,0.8205,0.2235,0.1028,1,0,1,0,0,0,0,0,0,1,0,0,0,0,0,0,0,0,0,0
5,40,F,M,59,Y,,Y,N,,,160,N,N,N,N,N,N,Y,N,POCS,1991-06,99,99,3,Y,L,Y,Y,Y,,N,14,,,N,N,N,N,N,N,,,N,,,N,,,Y,N,N,N,,N,,N,,,,N,,Y,41,,N,,0,,N,,,,,U,N,A,Y,N,41,237,PORT,19,,,Y,Y,0,237,0.1731,0.0329,0.0138,1,0,3,0,0,0,0,0,0,0,0,0,0,0,0,0,0,0,0,0
6,30,F,M,65,N,,Y,N,,,140,N,N,N,N,N,N,Y,N,POCS,1991-06,99,99,3,N,N,N,Y,N,,N,5,,,N,N,N,N,N,N,,,N,,,N,,,Y,N,N,N,,N,,N,,,,N,,Y,22,,N,,0,,N,,,,,Y,N,A,,,28,185,UK,27,,,Y,Y,0,185,0.221,0.0465,0.0161,1,0,4,0,0,0,0,0,0,0,0,0,0,0,0,0,0,0,0,0
1,16,F,M,57,N,,Y,N,,,160,Y,Y,Y,N,N,N,Y,N,POCS,1991-06,99,99,7,Y,H,Y,Y,N,,Y,14,,,N,N,N,N,Y,N,,,N,,,N,,,Y,N,N,N,,N,,N,,,,N,,N,,,N,,0,,N,,,,,N,Y,A,,,24,184,UK,27,,,Y,Y,0,184,0.4128,0.0752,0.0366,1,0,2,0,0,0,0,0,0,0,0,0,0,0,0,0,0,0,0,0
10,24,F,F,60,N,,Y,N,,,140,Y,Y,Y,N,N,N,N,N,LACS,1991-06,99,99,7,Y,N,y,Y,N,,N,11,,,N,N,Y,N,Y,N,,,N,,,N,,,Y,N,N,N,,N,,N,,,,N,,Y,32,,N,,0,,N,,,,,N,N,A,Y,N,54,201,ITAL,14,,,N,Y,0,201,0.4219,0.0553,0.0246,1,0,3,0,0,0,0,0,0,0,0,0,0,0,0,0,0,0,0,0
3,32,F,M,63,N,,Y,N,,,130,Y,Y,Y,Y,N,N,N,N,PACS,1991-06,99,99,1,N,L,N,N,Y,,N,8,,,N,N,N,N,Y,N,,,N,,,N,,,Y,N,N,N,,N,,N,,,,N,,Y,30,,N,,0,,N,,,,,N,N,A,U,U,53,190,ITAL,14,,,Y,Y,0,190,0.4991,0.1061,0.0428,1,0,3,0,0,0,0,0,0,0,0,0,0,0,0,0,0,0,0,0
6,18,F,F,77,N,,N,N,,,145,Y,Y,Y,Y,N,N,N,N,PACS,1991-06,99,99,3,N,N,N,N,N,,N,9,,,N,N,N,N,N,N,,,N,,,N,,,Y,N,N,N,,N,,N,,,,N,,Y,33,,N,,0,,N,,,,,N,N,E,,,37,175,UK,27,,,Y,Y,0,175,0.725,0.1875,0.0531,1,0,3,0,0,0,0,0,0,0,0,0,0,0,0,0,0,0,0,0
1,9,F,M,66,Y,,N,N,,,160,Y,Y,Y,N,N,N,N,N,LACS,1991-06,99,99,6,Y,N,Y,Y,N,,N,13,,,N,N,N,N,N,N,,,N,,,N,,,Y,N,N,N,,N,,N,,,,N,,Y,40,,N,,0,,N,,,,,N,Y,A,,,13,172,UK,27,,,Y,Y,0,172,0.3971,0.0912,0.0327,1,0,2,0,0,0,0,0,0,0,0,0,0,0,0,0,0,0,0,0
4,26,F,F,65,N,,Y,Y,,,130,Y,Y,Y,Y,C,C,N,N,TACS,1991-06,99,99,1,Y,N,Y,Y,N,,N,14,,,N,N,N,N,N,N,,,N,,,N,,,Y,N,N,N,,N,,N,,,,N,,N,,,N,,0,,N,,,,,N,N,A,,,29,174,UK,27,,,Y,Y,0,174,0.7756,0.1791,0.0764,1,0,3,0,0,0,0,0,0,0,0,0,0,0,0,0,0,0,0,0
1,8,F,F,54,N,,N,N,,,190,Y,Y,Y,N,N,N,N,N,LACS,1991-07,99,99,5,N,H,N,Y,N,,Y,14,,,N,N,N,N,N,N,,,N,,,N,,,Y,N,N,N,,N,,N,,,,N,,Y,32,,N,,0,,N,,,,,N,Y,A,,,48,188,UK,27,,,Y,Y,0,188,0.3595,0.0384,0.021,1,0,2,0,0,0,0,0,0,0,0,0,0,0,0,0,0,0,0,0
4,6,F,M,63,Y,,N,N,,,180,Y,Y,Y,N,Y,N,N,N,PACS,1991-07,99,99,5,N,L,N,N,N,,N,14,,,N,N,N,N,N,N,,,N,,,N,,,N,Y,N,N,,N,,N,,,,N,,N,,,N,,0,,Y,,74,5,,,,,,,18, 1 / 573    ,UK,27,,11,Y,N,1,71,0.4657,0.1038,0.0424,1,0,1,0,0,0,0,1,0,0,0,0,0,0,0,0,0,0,0,0
3,36,F,M,79,Y,,Y,Y,,,150,Y,Y,Y,N,N,N,N,N,LACS,1991-07,99,99,5,Y,L,Y,Y,Y,,N,14,,,N,N,N,N,Y,N,,,N,,,N,,,Y,N,N,N,,N,,N,,,,N,,N,,,N,,0,,N,,,,,Y,N,A,N,N,36,189,ITAL,14,,,Y,Y,0,189,0.5855,0.1802,0.0453,1,0,4,0,0,0,0,0,0,0,0,0,0,0,0,0,0,0,0,0
10,12,F,M,64,N,,Y,Y,,,140,Y,Y,Y,Y,N,N,N,N,PACS,1991-07,99,99,4,Y,N,Y,Y,N,,N,14,,,N,N,Y,N,N,N,,,N,,,N,,,Y,N,N,N,,N,,N,,,,N,,Y,25,,N,,0,,N,,,,,N,N,A,Y,N,36,185,ITAL,14,,,Y,Y,0,185,0.4954,0.1106,0.0437,1,0,3,0,0,0,0,0,0,0,0,0,0,0,0,0,0,0,0,0
6,34,F,M,75,Y,,N,N,,,170,Y,Y,Y,Y,Y,C,C,C,TACS,1991-07,99,99,4,N,H,N,N,N,,N,14,,,N,N,N,N,N,N,,,N,,,Y,10,VOMITED BLOOD,u,N,Y,N,,N,,N,,,,N,,N,,,N,,0,,Y,,43,4,,,,,,,22,588,UK,27,23,,Y,N,1,34,0.8514,0.3873,0.1461,1,0,1,0,0,0,1,0,0,0,0,0,0,0,0,0,0,0,0,1
6,25,F,M,81,N,,N,N,,,130,Y,Y,Y,Y,Y,C,C,C,TACS,1991-07,99,99,4,Y,L,N,Y,N,,N,13,,,N,N,N,N,N,N,,,N,,,N,,,u,N,Y,N,,N,,N,,,,N,,Y,22,,N,,0,,Y,,24,4,,,,,,,36,588,UK,27,,11,N,N,1,15,0.9055,0.4775,0.167,1,0,1,0,0,0,1,0,0,0,0,0,0,0,0,0,0,0,0,0
6,12,F,M,72,N,,N,N,,,170,Y,Y,Y,Y,Y,Y,N,N,TACS,1991-07,99,99,6,N,N,N,N,N,,N,14,,,N,N,N,N,N,N,,,N,,,N,,,U,N,Y,N,,N,,N,,,,N,,N,,,N,,0,,N,,,,,N,Y,A,,,20,223,UK,27,,,Y,Y,0,223,0.7628,0.2802,0.1014,1,0,2,0,0,0,0,0,0,0,0,0,0,0,0,0,0,0,0,0
6,24,F,M,78,N,,N,N,,,130,N,N,N,N,N,N,Y,N,POCS,1991-07,99,99,6,Y,N,Y,Y,N,,N,5,,,N,N,N,N,N,N,,,N,,,N,,,U,N,Y,N,,N,,N,,,,N,,Y,16,,N,,0,,N,,,,,N,Y,D,,,20,178,UK,27,,,Y,Y,0,178,0.3823,0.0976,0.0226,1,0,2,0,0,0,0,0,0,0,0,0,0,0,0,0,0,0,0,0
10,30,F,M,70,Y,,Y,N,,,140,Y,Y,Y,N,N,N,N,N,LACS,1991-07,99,99,2,N,L,N,Y,Y,,N,10,,,N,N,Y,N,N,N,,,N,,,N,,,Y,N,N,N,,N,,N,,,,N,,Y,24,,N,,0,,N,,,,,N,N,A,Y,N,31,186,ITAL,14,,,Y,Y,0,186,0.4662,0.1158,0.0366,1,0,3,0,0,0,0,0,0,0,0,0,0,0,0,0,0,0,0,0
4,25,F,F,77,N,,N,N,,,170,Y,Y,Y,N,N,C,N,N,PACS,1991-07,99,99,4,N,N,N,Y,N,,N,14,,,N,N,N,N,N,N,,,N,,,N,,,Y,N,N,N,,N,,N,,,,N,,Y,33,,N,,0,,N,,,,,Y,Y,A,,,29,194,UK,27,,,Y,Y,0,194,0.7063,0.1816,0.0522,1,0,2,0,0,0,0,0,0,0,0,0,0,0,0,0,0,0,0,0
1,3,F,F,84,N,,Y,N,,,145,Y,Y,Y,N,C,Y,N,N,TACS,1991-07,99,99,1,Y,H,Y,N,N,,Y,14,,,N,N,N,N,N,N,,,Y,34,R LEG HAEM. TRANSFUSED,N,,,Y,N,N,N,,N,,N,,,,N,,N,,,N,,0,,N,,,,,N,Y,E,,,25,183,UK,27,35,,Y,Y,0,183,0.8679,0.3291,0.0871,1,0,2,0,0,0,0,0,0,0,0,0,0,0,0,0,0,0,1,1
4,16,F,M,65,N,,N,N,,,155,Y,Y,Y,Y,C,C,N,N,TACS,1991-07,99,99,3,Y,N,Y,Y,N,,N,14,,,N,N,N,N,N,N,,,N,,,N,,,Y,N,N,N,,N,,N,,,,N,,N,,,N,,0,,N,,,,,N,Y,A,,,133,186,UK,27,,,Y,Y,0,186,0.6934,0.2003,0.0854,1,0,2,0,0,0,0,0,0,0,0,0,0,0,0,0,0,0,0,0
2,9,F,M,76,N,,Y,N,,,160,N,N,N,Y,N,N,N,Y,PACS,1991-07,99,99,5,N,N,N,Y,N,,N,14,,,N,N,Y,N,N,N,,,N,,,N,,,Y,N,N,N,,N,,N,,,,N,,Y,39,,N,,0,,N,,,,,N,Y,A,Y,N,21,183,ITAL,14,,,Y,Y,0,183,0.4329,0.1194,0.0304,1,0,2,0,0,0,0,0,0,0,0,0,0,0,0,0,0,0,0,0
2,22,D,F,82,N,,Y,N,,,180,Y,Y,Y,Y,Y,C,N,N,TACS,1991-07,99,99,7,Y,N,Y,Y,N,,N,14,,,N,N,Y,N,Y,N,,,N,,,Y,,DVT,Y,N,N,N,,N,,N,,,,N,,N,,,Y,52,,,Y,,52,4,,,,,,,32,53,ITAL,14,,,Y,Y,1,26,0.9605,0.6129,0.2947,1,0,1,0,0,0,1,0,0,0,0,0,0,0,0,0,0,1,0,0
1,3,F,M,68,N,,N,N,,,120,Y,Y,Y,N,N,Y,N,N,PACS,1991-08,99,99,5,N,L,N,Y,Y,,N,4,,,N,N,N,N,N,N,,,N,,,N,,,Y,N,N,N,,N,,N,,,,N,,Y,4,,N,,0,,Y,,8,2,,,,,,,20,8,UK,27,,,Y,Y,1,8,0.5713,0.1375,0.0484,1,1,1,0,1,0,0,0,0,0,0,0,0,1,1,0,0,0,0,0
3,42,F,M,62,N,,Y,Y,,,180,N,Y,N,N,N,N,N,N,PACS,1991-08,99,99,5,Y,H,Y,Y,N,,Y,14,,,N,N,N,N,N,N,,,N,,,N,,,Y,N,N,N,,N,,N,,,,N,,N,,,N,,0,,N,,,,,Y,N,A,Y,N,26,191,ITAL,14,,,Y,Y,0,191,0.1919,0.0401,0.0151,1,0,4,0,0,0,0,0,0,0,0,0,0,0,0,0,0,0,0,0
10,24,F,M,83,N,,Y,Y,,,140,Y,Y,N,N,N,N,N,N,LACS,1991-08,99,99,5,N,N,N,Y,N,,N,14,,,N,N,Y,N,N,N,,,N,,,N,,,Y,N,N,N,,N,,N,,,,N,,Y,15,,N,,0,,N,,,,,Y,N,A,N,N,34,200,ITAL,14,,,Y,Y,0,200,0.5529,0.1653,0.0356,1,0,4,0,0,0,0,0,0,0,0,0,0,0,0,0,0,0,0,0
5,32,D,M,66,N,,Y,Y,,,180,Y,Y,Y,N,N,Y,N,N,PACS,1991-08,99,99,5,N,N,N,Y,N,,N,14,,,N,N,N,N,N,N,,,N,,,N,,,Y,N,N,N,,N,,N,,,,N,,Y,14,,N,,0,,N,,,,,U,N,A,Y,U,26,201,PORT,19,,,Y,Y,0,201,0.7444,0.2669,0.1349,1,0,3,0,0,0,0,0,0,0,0,0,0,0,0,0,0,0,0,0
1,10,F,M,70,N,,Y,N,,,145,N,N,N,Y,N,N,N,N,PACS,1991-08,99,99,5,Y,L,Y,Y,Y,,N,14,,,N,N,N,N,N,N,,,N,,,N,,,Y,N,N,N,,N,,N,,,,N,,Y,14,,N,,0,,N,,,,,N,N,A,,,20,187,UK,27,,,Y,Y,0,187,0.2616,0.0615,0.0183,1,0,3,0,0,0,0,0,0,0,0,0,0,0,0,0,0,0,0,0
6,22,F,M,66,N,,N,N,,,140,Y,Y,Y,N,Y,Y,N,N,TACS,1991-08,99,99,6,N,H,N,Y,N,,Y,7,,,N,N,N,N,N,N,,,N,,,N,,,N,N,Y,N,,N,,N,,,,N,,Y,8,,N,,0,,N,,,,,N,Y,A,,,47,185,UK,27,,,Y,Y,0,185,0.6211,0.1622,0.0636,1,0,2,0,0,0,0,0,0,0,0,0,0,0,0,0,0,0,0,0
2,25,F,M,73,Y,,Y,Y,,,150,N,Y,N,N,N,N,Y,N,POCS,1991-08,99,99,7,Y,L,Y,Y,Y,,N,11,,,N,N,N,N,Y,N,,,N,,,N,,,Y,N,N,N,,N,,N,,,,N,,Y,13,,N,,0,,N,,,,,N,Y,A,N,N,14,184,ITAL,14,,,Y,Y,0,184,0.3839,0.0974,0.0276,1,0,2,0,0,0,0,0,0,0,0,0,0,0,0,0,0,0,0,0
6,12,F,F,80,N,,N,N,,,220,Y,Y,Y,Y,N,N,N,N,PACS,1991-08,99,99,2,Y,N,N,N,N,,N,14,,,N,N,N,N,N,N,,,N,,,N,,,N,N,Y,N,,N,,N,,,,N,,N,,,Y,51,4,,Y,,51,4,,,,,,,109,109,UK,27,,12,N,Y,1,47,0.7778,0.2163,0.0571,1,0,1,0,0,0,1,0,0,0,0,0,0,0,0,0,0,0,0,0
1,24,F,M,51,N,,N,N,,,190,N,N,N,N,N,N,Y,N,POCS,1991-08,99,99,2,N,N,N,Y,N,,N,4,,,Y,N,N,N,N,N,,,N,,,N,,,Y,N,N,N,,N,,N,,,,N,,Y,8,,N,,0,,N,,,,,N,N,A,,,16,190,UK,27,,11,Y,Y,0,190,0.1416,0.0205,0.0113,1,0,3,0,0,0,0,0,0,0,0,0,0,0,0,0,0,0,0,0
5,36,F,M,68,Y,,Y,N,,,180,Y,Y,Y,N,N,N,N,N,LACS,1991-08,99,99,3,Y,N,Y,Y,N,,N,10,,,N,N,N,N,N,N,,,N,,,N,,,Y,N,N,N,,N,,N,,,,N,,Y,15,,N,,0,,N,,,,,Y,N,A,Y,U,21,188,PORT,19,,,Y,Y,0,188,0.4199,0.1022,0.0345,1,0,4,0,0,0,0,0,0,0,0,0,0,0,0,0,0,0,0,0
8,35,F,M,66,N,,Y,Y,,,130,N,N,N,N,Y,N,N,N,POCS,1991-08,99,99,4,N,H,N,N,N,,Y,2,,,N,N,N,N,N,N,,,N,,,N,,,Y,N,N,N,,N,,N,,,,N,,Y,8,,N,,0,,N,,,,,N,N,A,,,28,183,UK,27,,,Y,Y,0,183,0.2395,0.0498,0.0166,1,0,3,0,0,0,0,0,0,0,0,0,0,0,0,0,0,0,0,0
6,4,F,M,78,Y,,N,N,,,150,Y,Y,N,N,N,N,N,N,LACS,1991-08,99,99,6,Y,L,Y,Y,Y,,N,14,N,N,N,N,N,N,N,N,,,N,,,N,,,Y,N,N,N,,N,,N,,,,N,,Y,23,,N,,0,,N,,,,,N,N,A,,,40,193,UK,27,,,Y,Y,0,193,0.4703,0.1327,0.032,1,0,3,0,0,0,0,0,0,0,0,0,0,0,0,0,0,0,0,0
4,8,F,M,75,N,,N,N,,,150,N,Y,Y,N,N,N,Y,Y,POCS,1991-08,99,99,6,N,N,N,Y,N,,N,7,,,N,N,N,N,N,N,,,N,,,N,,,Y,N,N,N,,N,,N,,,,N,,Y,15,,N,,0,,N,,,,,N,N,A,,,26,193,UK,27,,,Y,Y,0,193,0.6237,0.1916,0.0569,1,0,3,0,0,0,0,0,0,0,0,0,0,0,0,0,0,0,0,0
8,43,F,F,77,N,,Y,Y,,,160,Y,Y,Y,N,C,Y,C,N,TACS,1991-08,99,99,7,Y,N,Y,Y,N,,N,14,,,N,N,N,N,N,N,,,N,,,N,,,Y,N,N,N,,N,,N,,,,N,,N,,,N,,0,,Y,,133,6,,,,,,,59,529,UK,27,,,Y,Y,1,124,0.8579,0.3113,0.1017,1,0,1,0,0,0,0,0,1,0,0,0,0,0,0,0,0,0,0,0
1,5,F,F,55,N,,Y,N,,,140,Y,Y,Y,Y,N,N,N,N,PACS,1991-08,99,99,2,N,N,N,N,N,,N,4,,,N,N,N,N,N,N,,,N,,,N,,,Y,N,N,N,,N,,N,,,,N,,Y,15,,N,,0,,N,,,,,Y,N,A,N,N,9,219,UK,27,,,Y,Y,0,219,0.4891,0.0585,0.0308,1,0,4,0,0,0,0,0,0,0,0,0,0,0,0,0,0,0,0,0